Reaction Details
TargetSigma non-opioid intracellular receptor 1
LigandBDBM50145021
Substrate/Competitorn/a
Meas. Tech.ChEMBL_200962 (CHEMBL802050)
Ki 0.036±n/a nM
Citation Berardi, FFerorelli, SAbate, CColabufo, NAContino, MPerrone, RTortorella, V 4-(tetralin-1-yl)- and 4-(naphthalen-1-yl)alkyl derivatives of 1-cyclohexylpiperazine as sigma receptor ligands with agonist sigma2 activity. J Med Chem47:2308-17 (2004) 
 
Sigma non-opioid intracellular receptor 1
Name:Sigma non-opioid intracellular receptor 1
Type:Enzyme Catalytic Domain
Mol. Mass.:25124.85
Organism:Homo sapiens (Human)
Description:Q99720
Residue:223
BDBM50145021
NameBDBM50145021
Synonyms:1-Cyclohexyl-4-[4-(1,2,3,4-tetrahydro-naphthalen-1-yl)-butyl]-piperazine | CHEMBL76758
TypeSmall organic molecule
Emp. Form.C24H38N2
Mol. Mass.354.5719
SMILESC(CCN1CCN(CC1)C1CCCCC1)CC1CCCc2ccccc12