Reaction Details
TargetPotassium voltage-gated channel subfamily A member 3
LigandBDBM50145057
Substrate/Competitorn/a
Meas. Tech.ChEMBL_214956 (CHEMBL821185)
Kd 100000±n/a nM
Citation Baell, JBGable, RWHarvey, AJToovey, NHerzog, THänsel, WWulff, H Khellinone derivatives as blockers of the voltage-gated potassium channel Kv1.3: synthesis and immunosuppressive activity. J Med Chem47:2326-36 (2004) 
 
Potassium voltage-gated channel subfamily A member 3
Name:Potassium voltage-gated channel subfamily A member 3
Type:PROTEIN
Mol. Mass.:63835.47
Organism:Homo sapiens (Human)
Description:ChEMBL_1513935
Residue:575
BDBM50145057
NameBDBM50145057
Synonyms:1-(6-Hydroxy-4-methoxy-benzofuran-5-yl)-ethanone | CHEMBL422416
TypeSmall organic molecule
Emp. Form.C11H10O4
Mol. Mass.206.1947
SMILESCOc1c(C(C)=O)c(O)cc2occc12