Reaction Details
TargetPotassium voltage-gated channel subfamily A member 3
LigandBDBM50145054
Substrate/Competitorn/a
Meas. Tech.ChEMBL_214956 (CHEMBL821185)
Kd 800±n/a nM
Citation Baell, JBGable, RWHarvey, AJToovey, NHerzog, THänsel, WWulff, H Khellinone derivatives as blockers of the voltage-gated potassium channel Kv1.3: synthesis and immunosuppressive activity. J Med Chem47:2326-36 (2004) 
 
Potassium voltage-gated channel subfamily A member 3
Name:Potassium voltage-gated channel subfamily A member 3
Type:PROTEIN
Mol. Mass.:63835.47
Organism:Homo sapiens (Human)
Description:ChEMBL_1513935
Residue:575
BDBM50145054
NameBDBM50145054
Synonyms:(E)-1-(6-Hydroxy-4,7-dimethoxy-benzofuran-5-yl)-3-(3-methoxy-phenyl)-propenone CHEMBL76543
TypeSmall organic molecule
Emp. Form.C20H18O6
Mol. Mass.354.3533
SMILESCOc1cccc(\C=C\C(=O)c2c(O)c(OC)c3occc3c2OC)c1