Reaction Details
TargetPotassium voltage-gated channel subfamily A member 3
LigandBDBM50145067
Substrate/Competitorn/a
Meas. Tech.ChEMBL_214956 (CHEMBL821185)
Kd 3000±n/a nM
Citation Baell, JBGable, RWHarvey, AJToovey, NHerzog, THänsel, WWulff, H Khellinone derivatives as blockers of the voltage-gated potassium channel Kv1.3: synthesis and immunosuppressive activity. J Med Chem47:2326-36 (2004) 
 
Potassium voltage-gated channel subfamily A member 3
Name:Potassium voltage-gated channel subfamily A member 3
Type:PROTEIN
Mol. Mass.:63835.47
Organism:Homo sapiens (Human)
Description:ChEMBL_1513935
Residue:575
BDBM50145067
NameBDBM50145067
Synonyms:1-{6-[7-(5-Acetyl-4,7-dimethoxy-benzofuran-6-yloxy)-heptyloxy]-4,7-dimethoxy-benzofuran-5-yl}-ethanone | CHEMBL78004
TypeSmall organic molecule
Emp. Form.C31H36O10
Mol. Mass.568.6115
SMILESCOc1c(C(C)=O)c(OCCCCCCCOc2c(OC)c3occc3c(OC)c2C(C)=O)c(OC)c2occc12