Reaction Details
TargetPoly [ADP-ribose] polymerase 1
LigandBDBM50145214
Substrate/Competitorn/a
Meas. Tech.ChEBML_159827
Ki 3.2±n/a nM
Citation White, AWCurtin, NJEastman, BWGolding, BTHostomsky, ZKyle, SLi, JMaegley, KASkalitzky, DJWebber, SEYu, XHGriffin, RJ Potentiation of cytotoxic drug activity in human tumour cell lines, by amine-substituted 2-arylbenzimidazole-4-carboxamide PARP-1 inhibitors. Bioorg Med Chem Lett14:2433-7 (2004) 
 
Poly [ADP-ribose] polymerase 1
Name:Poly [ADP-ribose] polymerase 1
Type:n/a
Mol. Mass.:113114.22
Organism:Homo sapiens (Human)
Description:P09874
Residue:1014
BDBM50145214
NameBDBM50145214
Synonyms:2-(4-((methylamino)methyl)phenyl)-1H-benzo[d]imidazole-4-carboxamide CHEMBL83916
TypeSmall organic molecule
Emp. Form.C16H16N4O
Mol. Mass.280.3244
SMILESCNCc1ccc(cc1)-c1nc2c(cccc2[nH]1)C(N)=O