Reaction Details
TargetNeuropeptide Y receptor type 5
LigandBDBM50145235
Substrate/Competitorn/a
Meas. Tech.ChEBML_144155
IC50 2±n/a nM
Citation Rueeger, HGerspacher, MBuehlmayer, PRigollier, PYamaguchi, YSchmidlin, TWhitebread, SNuesslein-Hildesheim, BNick, HCricione, L Discovery and SAR of potent, orally available and brain-penetrable 5,6-dihydro-4H-3-thia-1-aza-benzo[e]azulen- and 4,5-dihydro-6-oxa-3-thia-1-aza-benzo[e]azulen derivatives as neuropeptide Y Y5 receptor antagonists. Bioorg Med Chem Lett14:2451-7 (2004) 
 
Neuropeptide Y receptor type 5
Name:Neuropeptide Y receptor type 5
Type:Enzyme
Mol. Mass.:50746.64
Organism:Homo sapiens (Human)
Description:Q15761
Residue:445
BDBM50145235
NameBDBM50145235
Synonyms:CHEMBL432169 | {4-[(9-Fluoro-5,6-dihydro-4H-3-thia-1-aza-benzo[e]azulen-2-ylamino)-methyl]-piperidin-1-yl}-(S)-tetrahydro-furan-2-yl-methanone
TypeSmall organic molecule
Emp. Form.C23H28FN3O2S
Mol. Mass.429.551
SMILESFc1ccc2CCCc3sc(NCC4CCN(CC4)C(=O)[C@@H]4CCCO4)nc3-c2c1