Reaction Details
TargetNeuropeptide Y receptor type 5
LigandBDBM50145243
Substrate/Competitorn/a
Meas. Tech.ChEBML_144155
IC50 3±n/a nM
Citation Rueeger, HGerspacher, MBuehlmayer, PRigollier, PYamaguchi, YSchmidlin, TWhitebread, SNuesslein-Hildesheim, BNick, HCricione, L Discovery and SAR of potent, orally available and brain-penetrable 5,6-dihydro-4H-3-thia-1-aza-benzo[e]azulen- and 4,5-dihydro-6-oxa-3-thia-1-aza-benzo[e]azulen derivatives as neuropeptide Y Y5 receptor antagonists. Bioorg Med Chem Lett14:2451-7 (2004) 
 
Neuropeptide Y receptor type 5
Name:Neuropeptide Y receptor type 5
Type:Enzyme
Mol. Mass.:50746.64
Organism:Homo sapiens (Human)
Description:Q15761
Residue:445
BDBM50145243
NameBDBM50145243
Synonyms:CHEMBL83830 | N,N-dimethyl-N'-({4-[(19-Fluoro-2-methyl-4,5-dihydro-3,6-dithia-1-aza-benzo[e]azulene)amino]cyclohexyl}methyl)-sulfamide
TypeSmall organic molecule
Emp. Form.C20H27FN4O2S3
Mol. Mass.470.647
SMILESCN(C)S(=O)(=O)NC[C@H]1CC[C@@H](CC1)Nc1nc-2c(CCSc3ccc(F)cc-23)s1