Reaction Details
TargetNeuropeptide Y receptor type 5
LigandBDBM50145256
Substrate/Competitorn/a
Meas. Tech.ChEBML_144155
IC50 3±n/a nM
Citation Rueeger, HGerspacher, MBuehlmayer, PRigollier, PYamaguchi, YSchmidlin, TWhitebread, SNuesslein-Hildesheim, BNick, HCricione, L Discovery and SAR of potent, orally available and brain-penetrable 5,6-dihydro-4H-3-thia-1-aza-benzo[e]azulen- and 4,5-dihydro-6-oxa-3-thia-1-aza-benzo[e]azulen derivatives as neuropeptide Y Y5 receptor antagonists. Bioorg Med Chem Lett14:2451-7 (2004) 
 
Neuropeptide Y receptor type 5
Name:Neuropeptide Y receptor type 5
Type:Enzyme
Mol. Mass.:50746.64
Organism:Homo sapiens (Human)
Description:Q15761
Residue:445
BDBM50145256
NameBDBM50145256
Synonyms:1-{4-[(9-Fluoro-5,6-dihydro-4H-3-thia-1-aza-benzo[e]azulen-2-ylamino)-methyl]-piperidin-1-yl}-2-[2-((S)-methoxymethyl)-pyrrolidin-1-yl]-ethanone | CHEMBL81103
TypeSmall organic molecule
Emp. Form.C26H35FN4O2S
Mol. Mass.486.645
SMILESCOC[C@@H]1CCCN1CC(=O)N1CCC(CNc2nc-3c(CCCc4ccc(F)cc-34)s2)CC1