Reaction Details
TargetEstrogen receptor
LigandBDBM50145495
Substrate/Competitorn/a
Meas. Tech.ChEBML_67484
IC50 542±n/a nM
Citation Chen, HYKim, SWu, JYBirzin, ETChan, WYang, YTDahllund, JDiNinno, FRohrer, SPSchaeffer, JMHammond, ML Estrogen receptor ligands. Part 3: The SAR of dihydrobenzoxathiin SERMs. Bioorg Med Chem Lett14:2551-4 (2004) 
 
Estrogen receptor
Name:Estrogen receptor
Type:Protein
Mol. Mass.:66230.44
Organism:Homo sapiens (Human)
Description:P03372
Residue:595
BDBM50145495
NameBDBM50145495
Synonyms:(2S,3R)-2-[4-(2-Piperidin-1-yl-ethoxy)-phenyl]-3-pyridin-3-yl-2,3-dihydro-benzo[1,4]oxathiin-6-ol | CHEMBL83060
TypeSmall organic molecule
Emp. Form.C26H28N2O3S
Mol. Mass.448.577
SMILESOc1ccc2O[C@H]([C@H](Sc2c1)c1cccnc1)c1ccc(OCCN2CCCCC2)cc1