Reaction Details
TargetEstrogen receptor beta
LigandBDBM50145498
Substrate/Competitorn/a
Meas. Tech.ChEBML_67685
IC50 28±n/a nM
Citation Chen, HYKim, SWu, JYBirzin, ETChan, WYang, YTDahllund, JDiNinno, FRohrer, SPSchaeffer, JMHammond, ML Estrogen receptor ligands. Part 3: The SAR of dihydrobenzoxathiin SERMs. Bioorg Med Chem Lett14:2551-4 (2004) 
 
Estrogen receptor beta
Name:Estrogen receptor beta
Type:Protein
Mol. Mass.:59238.43
Organism:Homo sapiens (Human)
Description:Q92731
Residue:530
BDBM50145498
NameBDBM50145498
Synonyms:(2S,3R)-3-Cycloheptyl-2-[4-(2-piperidin-1-yl-ethoxy)-phenyl]-2,3-dihydro-benzo[1,4]oxathiin-6-ol | CHEMBL316132
TypeSmall organic molecule
Emp. Form.C28H37NO3S
Mol. Mass.467.663
SMILESOc1ccc2O[C@H]([C@H](Sc2c1)C1CCCCCC1)c1ccc(OCCN2CCCCC2)cc1