Reaction Details
TargetEstrogen receptor beta
LigandBDBM19441
Substrate/Competitorn/a
Meas. Tech.ChEMBL_79391 (CHEMBL687924)
IC50 4±n/a nM
Citation Chen, HYKim, SWu, JYBirzin, ETChan, WYang, YTDahllund, JDiNinno, FRohrer, SPSchaeffer, JMHammond, ML Estrogen receptor ligands. Part 3: The SAR of dihydrobenzoxathiin SERMs. Bioorg Med Chem Lett14:2551-4 (2004) 
 
Estrogen receptor beta
Name:Estrogen receptor beta
Synonyms:Estrogen receptor
Type:n/a
Mol. Mass.:n/a
Description:ASSAY_ID of ChEMBL is 99778
Components:This complex has 2 components.
Component 1
Name:Estrogen receptor beta
Type:Protein
Mol. Mass.:59238.43
Organism:Homo sapiens (Human)
Description:Q92731
Residue:530
Component 2
Name:Estrogen receptor
Synonyms:ER ESR ESR1_HUMAN Estrogen receptor Estrogen receptor (ER-alpha) Estrogen receptor alpha (ER) Nuclear receptor subfamily 3 group A member 1
Type:Protein
Mol. Mass.:66230.44
Organism:Homo sapiens (Human)
Description:P03372
Residue:595
BDBM19441
NameBDBM19441
Synonyms:2-(4-hydroxyphenyl)-3-({4-[2-(piperidin-1-yl)ethoxy]phenyl}carbonyl)-1-benzothiophen-6-ol Evista RALOXIFENE HYDROCHLORIDE Raloxifene (7) [6-hydroxy-2-(4-hydroxyphenyl)-1-benzothiophen-3-yl]-[4-(2-piperidin-1-ylethoxy)phenyl]methanone | cid_11071264
TypeSmall organic molecule
Emp. Form.C28H27NO4S
Mol. Mass.473.583
SMILESOc1ccc(cc1)-c1sc2cc(O)ccc2c1C(=O)c1ccc(OCCN2CCCCC2)cc1