Reaction Details
TargetProto-oncogene tyrosine-protein kinase Src
LigandBDBM8797
Substrate/Competitorn/a
Meas. Tech.ChEBML_202610
IC50 189±n/a nM
Citation Borhani, DWCalderwood, DJFriedman, MMHirst, GCLi, BLeung, AKMcRae, BRatnofsky, SRitter, KWaegell, W A-420983: a potent, orally active inhibitor of lck with efficacy in a model of transplant rejection. Bioorg Med Chem Lett14:2613-6 (2004) 
 
Proto-oncogene tyrosine-protein kinase Src
Name:Proto-oncogene tyrosine-protein kinase Src
Type:Protein
Mol. Mass.:59838.60
Organism:Homo sapiens (Human)
Description:P12931
Residue:536
BDBM8797
NameBDBM8797
Synonyms:CHEMBL297363 Pyrazolo[3,4-d]pyrimidine 5
TypeSmall organic molecule
Emp. Form.C30H36N8O2
Mol. Mass.540.6592
SMILESCOc1cc(ccc1NC(=O)c1ccccc1)-c1nn([C@H]2CC[C@@H](CC2)N2CCN(C)CC2)c2ncnc(N)c12