Reaction Details
TargetTyrosine-protein kinase Lck
LigandBDBM8798
Substrate/Competitorn/a
Meas. Tech.ChEBML_221313
IC50 5±n/a nM
Citation Borhani, DWCalderwood, DJFriedman, MMHirst, GCLi, BLeung, AKMcRae, BRatnofsky, SRitter, KWaegell, W A-420983: a potent, orally active inhibitor of lck with efficacy in a model of transplant rejection. Bioorg Med Chem Lett14:2613-6 (2004) 
 
Tyrosine-protein kinase Lck
Name:Tyrosine-protein kinase Lck
Type:n/a
Mol. Mass.:57987.83
Organism:Homo sapiens (Human)
Description:P06239
Residue:509
BDBM8798
NameBDBM8798
Synonyms:CHEMBL47787 benzyl N-(4-{4-amino-1-[4-(4-methylpiperazin-1-yl)cyclohexyl]-1H-pyrazolo[3,4-d]pyrimidin-3-yl}-2-methoxyphenyl)carbamate
TypeSmall organic molecule
Emp. Form.C31H38N8O3
Mol. Mass.570.6852
SMILESCOc1cc(ccc1NC(=O)OCc1ccccc1)-c1nn([C@H]2CC[C@@H](CC2)N2CCN(C)CC2)c2ncnc(N)c12