Reaction Details
TargetPeroxisome proliferator-activated receptor gamma
LigandBDBM50145717
Substrate/Competitorn/a
Meas. Tech.ChEMBL_153619 (CHEMBL760384)
IC50 297.0±n/a nM
Citation Xu, YRito, CJEtgen, GJArdecky, RJBean, JSBensch, WRBosley, JRBroderick, CLBrooks, DADominianni, SJHahn, PJLiu, SMais, DEMontrose-Rafizadeh, COgilvie, KMOldham, BAPeters, MRungta, DKShuker, AJStephenson, GATripp, AEWilson, SBWinneroski, LLZink, RKauffman, RFMcCarthy, JR Design and synthesis of alpha-aryloxy-alpha-methylhydrocinnamic acids: a novel class of dual peroxisome proliferator-activated receptor alpha/gamma agonists. J Med Chem47:2422-5 (2004) 
 
Peroxisome proliferator-activated receptor gamma
Name:Peroxisome proliferator-activated receptor gamma
Type:Nuclear Receptor
Mol. Mass.:57613.46
Organism:Homo sapiens (Human)
Description:P37231
Residue:505
BDBM50145717
NameBDBM50145717
Synonyms:(R)-2-Methyl-3-{4-[2-(5-methyl-2-thiophen-2-yl-oxazol-4-yl)-ethoxy]-phenyl}-2-phenoxy-propionic acid | CHEMBL79426
TypeSmall organic molecule
Emp. Form.C26H25NO5S
Mol. Mass.463.545
SMILESCc1oc(nc1CCOc1ccc(C[C@@](C)(Oc2ccccc2)C(O)=O)cc1)-c1cccs1