Reaction Details
TargetPeroxisome proliferator-activated receptor alpha
LigandBDBM50145719
Substrate/Competitorn/a
Meas. Tech.ChEMBL_153383 (CHEMBL763569)
EC50 1±n/a nM
Citation Xu, YRito, CJEtgen, GJArdecky, RJBean, JSBensch, WRBosley, JRBroderick, CLBrooks, DADominianni, SJHahn, PJLiu, SMais, DEMontrose-Rafizadeh, COgilvie, KMOldham, BAPeters, MRungta, DKShuker, AJStephenson, GATripp, AEWilson, SBWinneroski, LLZink, RKauffman, RFMcCarthy, JR Design and synthesis of alpha-aryloxy-alpha-methylhydrocinnamic acids: a novel class of dual peroxisome proliferator-activated receptor alpha/gamma agonists. J Med Chem47:2422-5 (2004) 
 
Peroxisome proliferator-activated receptor alpha
Name:Peroxisome proliferator-activated receptor alpha
Type:Enzyme
Mol. Mass.:52222.08
Organism:Homo sapiens (Human)
Description:Q07869
Residue:468
BDBM50145719
NameBDBM50145719
Synonyms:(S)-3-{4-[2-(2-Cyclohexyl-5-methyl-oxazol-4-yl)-ethoxy]-phenyl}-2-methyl-2-phenoxy-propionic acid | CHEMBL264385
TypeSmall organic molecule
Emp. Form.C28H33NO5
Mol. Mass.463.5653
SMILESCc1oc(nc1CCOc1ccc(C[C@](C)(Oc2ccccc2)C(O)=O)cc1)C1CCCCC1