Reaction Details
TargetCorticotropin-releasing factor receptor 1
LigandBDBM50145735
Substrate/Competitorn/a
Meas. Tech.ChEMBL_51106 (CHEMBL666467)
Ki 204±n/a nM
Citation Molteni, VPenzotti, JWilson, DMTermin, APMao, LCrane, CMHassman, FWang, TWong, HMiller, KJGrossman, SGrootenhuis, PD N-phenylphenylglycines as novel corticotropin releasing factor receptor antagonists. J Med Chem47:2426-9 (2004) 
 
Corticotropin-releasing factor receptor 1
Name:Corticotropin-releasing factor receptor 1
Type:Enzyme
Mol. Mass.:50744.31
Organism:Homo sapiens (Human)
Description:P34998
Residue:444
BDBM50145735
NameBDBM50145735
Synonyms:1-(2-Bromo-phenyl)-1-(2,4-dichloro-phenylamino)-4-pyridin-4-yl-butan-2-one | CHEMBL81726
TypeSmall organic molecule
Emp. Form.C21H17BrCl2N2O
Mol. Mass.464.182
SMILESClc1ccc(NC(C(=O)CCc2ccncc2)c2ccccc2Br)c(Cl)c1