Reaction Details
TargetCorticotropin-releasing factor receptor 1
LigandBDBM50145738
Substrate/Competitorn/a
Meas. Tech.ChEMBL_51106 (CHEMBL666467)
Ki>10000±n/a nM
Citation Molteni, VPenzotti, JWilson, DMTermin, APMao, LCrane, CMHassman, FWang, TWong, HMiller, KJGrossman, SGrootenhuis, PD N-phenylphenylglycines as novel corticotropin releasing factor receptor antagonists. J Med Chem47:2426-9 (2004) 
 
Corticotropin-releasing factor receptor 1
Name:Corticotropin-releasing factor receptor 1
Type:Enzyme
Mol. Mass.:50744.31
Organism:Homo sapiens (Human)
Description:P34998
Residue:444
BDBM50145738
NameBDBM50145738
Synonyms:1-(2-Chloro-4-methyl-phenylamino)-1-(2-methoxy-phenyl)-4-pyridin-4-yl-butan-2-one | CHEMBL311595
TypeSmall organic molecule
Emp. Form.C23H23ClN2O2
Mol. Mass.394.894
SMILESCOc1ccccc1C(Nc1ccc(C)cc1Cl)C(=O)CCc1ccncc1