Reaction Details
TargetCorticotropin-releasing factor receptor 1
LigandBDBM50145740
Substrate/Competitorn/a
Meas. Tech.ChEMBL_51106 (CHEMBL666467)
Ki 752.0±n/a nM
Citation Molteni, VPenzotti, JWilson, DMTermin, APMao, LCrane, CMHassman, FWang, TWong, HMiller, KJGrossman, SGrootenhuis, PD N-phenylphenylglycines as novel corticotropin releasing factor receptor antagonists. J Med Chem47:2426-9 (2004) 
 
Corticotropin-releasing factor receptor 1
Name:Corticotropin-releasing factor receptor 1
Type:Enzyme
Mol. Mass.:50744.31
Organism:Homo sapiens (Human)
Description:P34998
Residue:444
BDBM50145740
NameBDBM50145740
Synonyms:1-(2-Chloro-4-methyl-phenylamino)-4-pyridin-4-yl-1-(2-vinyl-phenyl)-butan-2-one | CHEMBL81376
TypeSmall organic molecule
Emp. Form.C24H23ClN2O
Mol. Mass.390.905
SMILESCc1ccc(NC(C(=O)CCc2ccncc2)c2ccccc2C=C)c(Cl)c1