Reaction Details
TargetCorticotropin-releasing factor receptor 1
LigandBDBM50145758
Substrate/Competitorn/a
Meas. Tech.ChEMBL_51106 (CHEMBL666467)
Ki 469.0±n/a nM
Citation Molteni, VPenzotti, JWilson, DMTermin, APMao, LCrane, CMHassman, FWang, TWong, HMiller, KJGrossman, SGrootenhuis, PD N-phenylphenylglycines as novel corticotropin releasing factor receptor antagonists. J Med Chem47:2426-9 (2004) 
 
Corticotropin-releasing factor receptor 1
Name:Corticotropin-releasing factor receptor 1
Type:Enzyme
Mol. Mass.:50744.31
Organism:Homo sapiens (Human)
Description:P34998
Residue:444
BDBM50145758
NameBDBM50145758
Synonyms:1-(4-Chloro-2-trifluoromethyl-phenylamino)-4-pyridin-4-yl-1-o-tolyl-butan-2-one | CHEMBL312239
TypeSmall organic molecule
Emp. Form.C23H20ClF3N2O
Mol. Mass.432.866
SMILESCc1ccccc1C(Nc1ccc(Cl)cc1C(F)(F)F)C(=O)CCc1ccncc1