Reaction Details
TargetCorticotropin-releasing factor receptor 1
LigandBDBM50145760
Substrate/Competitorn/a
Meas. Tech.ChEMBL_51106 (CHEMBL666467)
Ki>10000±n/a nM
Citation Molteni, VPenzotti, JWilson, DMTermin, APMao, LCrane, CMHassman, FWang, TWong, HMiller, KJGrossman, SGrootenhuis, PD N-phenylphenylglycines as novel corticotropin releasing factor receptor antagonists. J Med Chem47:2426-9 (2004) 
 
Corticotropin-releasing factor receptor 1
Name:Corticotropin-releasing factor receptor 1
Type:Enzyme
Mol. Mass.:50744.31
Organism:Homo sapiens (Human)
Description:P34998
Residue:444
BDBM50145760
NameBDBM50145760
Synonyms:1-(2-Bromo-phenyl)-1-(2-chloro-4-methyl-phenylamino)-4-pyridin-3-yl-butan-2-one | CHEMBL79082
TypeSmall organic molecule
Emp. Form.C22H20BrClN2O
Mol. Mass.443.764
SMILESCc1ccc(NC(C(=O)CCc2cccnc2)c2ccccc2Br)c(Cl)c1