Reaction Details
TargetGenome polyprotein
LigandBDBM50145822
Substrate/Competitorn/a
Meas. Tech.ChEMBL_143475 (CHEMBL751815)
Kd>20000±n/a nM
Citation Wyss, DFArasappan, ASenior, MMWang, YSBeyer, BMNjoroge, FGMcCoy, MA Non-peptidic small-molecule inhibitors of the single-chain hepatitis C virus NS3 protease/NS4A cofactor complex discovered by structure-based NMR screening. J Med Chem47:2486-98 (2004) 
 
Genome polyprotein
Name:Genome polyprotein
Type:Protein
Mol. Mass.:67067.41
Organism:Hepatitis C virus
Description:A3EZI9
Residue:631
BDBM50145822
NameBDBM50145822
Synonyms:3-(4-Acetyl-phenoxy)-propionic acid | CHEMBL314598
TypeSmall organic molecule
Emp. Form.C11H12O4
Mol. Mass.208.2106
SMILESCC(=O)c1ccc(OCCC(O)=O)cc1