Reaction Details
TargetGenome polyprotein
LigandBDBM50145833
Substrate/Competitorn/a
Meas. Tech.ChEMBL_143477 (CHEMBL751817)
Ki 310000±n/a nM
Citation Wyss, DFArasappan, ASenior, MMWang, YSBeyer, BMNjoroge, FGMcCoy, MA Non-peptidic small-molecule inhibitors of the single-chain hepatitis C virus NS3 protease/NS4A cofactor complex discovered by structure-based NMR screening. J Med Chem47:2486-98 (2004) 
 
Genome polyprotein
Name:Genome polyprotein
Type:Protein
Mol. Mass.:67067.41
Organism:Hepatitis C virus
Description:A3EZI9
Residue:631
BDBM50145833
NameBDBM50145833
Synonyms:(S)-2-tert-Butoxycarbonylamino-3-(4-hydroxy-3,5-diiodo-phenyl)-propionic acid | CHEMBL84385
TypeSmall organic molecule
Emp. Form.C14H17I2NO5
Mol. Mass.533.0974
SMILESCC(C)(C)OC(=O)N[C@@H](Cc1cc(I)c(O)c(I)c1)C(O)=O