Reaction Details
TargetGenome polyprotein
LigandBDBM50145802
Substrate/Competitorn/a
Meas. Tech.ChEMBL_143475 (CHEMBL751815)
Kd>100000±n/a nM
Citation Wyss, DFArasappan, ASenior, MMWang, YSBeyer, BMNjoroge, FGMcCoy, MA Non-peptidic small-molecule inhibitors of the single-chain hepatitis C virus NS3 protease/NS4A cofactor complex discovered by structure-based NMR screening. J Med Chem47:2486-98 (2004) 
 
Genome polyprotein
Name:Genome polyprotein
Type:Protein
Mol. Mass.:67067.41
Organism:Hepatitis C virus
Description:A3EZI9
Residue:631
BDBM50145802
NameBDBM50145802
Synonyms:CHEMBL316156 | N-(4-Methoxy-phenyl)-2,2-dimethyl-propionamide
TypeSmall organic molecule
Emp. Form.C12H17NO2
Mol. Mass.207.2689
SMILESCOc1ccc(NC(=O)C(C)(C)C)cc1