Reaction Details
TargetGenome polyprotein
LigandBDBM50145827
Substrate/Competitorn/a
Meas. Tech.ChEMBL_143480 (CHEMBL751820)
Ki 650000±n/a nM
Citation Wyss, DFArasappan, ASenior, MMWang, YSBeyer, BMNjoroge, FGMcCoy, MA Non-peptidic small-molecule inhibitors of the single-chain hepatitis C virus NS3 protease/NS4A cofactor complex discovered by structure-based NMR screening. J Med Chem47:2486-98 (2004) 
 
Genome polyprotein
Name:Genome polyprotein
Type:Protein
Mol. Mass.:67067.41
Organism:Hepatitis C virus
Description:A3EZI9
Residue:631
BDBM50145827
NameBDBM50145827
Synonyms:CHEMBL311209 | N-[(4-methylbenzene)sulfonamido]benzenecarboimidothioic acid
TypeSmall organic molecule
Emp. Form.C14H14N2O2S2
Mol. Mass.306.403
SMILESCc1ccc(cc1)S(=O)(=O)NNC(=S)c1ccccc1