Reaction Details
TargetGenome polyprotein
LigandBDBM50145811
Substrate/Competitorn/a
Meas. Tech.ChEMBL_143475 (CHEMBL751815)
Kd>110000±n/a nM
Citation Wyss, DFArasappan, ASenior, MMWang, YSBeyer, BMNjoroge, FGMcCoy, MA Non-peptidic small-molecule inhibitors of the single-chain hepatitis C virus NS3 protease/NS4A cofactor complex discovered by structure-based NMR screening. J Med Chem47:2486-98 (2004) 
 
Genome polyprotein
Name:Genome polyprotein
Type:Protein
Mol. Mass.:67067.41
Organism:Hepatitis C virus
Description:A3EZI9
Residue:631
BDBM50145811
NameBDBM50145811
Synonyms:CHEMBL82702 | N-(4-Methoxy-phenyl)-succinamic acid
TypeSmall organic molecule
Emp. Form.C11H13NO4
Mol. Mass.223.2252
SMILESCOc1ccc(NC(=O)CCC(O)=O)cc1