Reaction Details
TargetGenome polyprotein
LigandBDBM50145814
Substrate/Competitorn/a
Meas. Tech.ChEMBL_143475 (CHEMBL751815)
Kd>8000000±n/a nM
Citation Wyss, DFArasappan, ASenior, MMWang, YSBeyer, BMNjoroge, FGMcCoy, MA Non-peptidic small-molecule inhibitors of the single-chain hepatitis C virus NS3 protease/NS4A cofactor complex discovered by structure-based NMR screening. J Med Chem47:2486-98 (2004) 
 
Genome polyprotein
Name:Genome polyprotein
Type:Protein
Mol. Mass.:67067.41
Organism:Hepatitis C virus
Description:A3EZI9
Residue:631
BDBM50145814
NameBDBM50145814
Synonyms:3-(4-Hydroxy-phenyl)-2-phenyl-propionic acid | CHEMBL82350
TypeSmall organic molecule
Emp. Form.C15H14O3
Mol. Mass.242.2699
SMILESOC(=O)C(Cc1ccc(O)cc1)c1ccccc1