Reaction Details
TargetGenome polyprotein
LigandBDBM50145815
Substrate/Competitorn/a
Meas. Tech.ChEMBL_143475 (CHEMBL751815)
Kd 140000±n/a nM
Citation Wyss, DFArasappan, ASenior, MMWang, YSBeyer, BMNjoroge, FGMcCoy, MA Non-peptidic small-molecule inhibitors of the single-chain hepatitis C virus NS3 protease/NS4A cofactor complex discovered by structure-based NMR screening. J Med Chem47:2486-98 (2004) 
 
Genome polyprotein
Name:Genome polyprotein
Type:Protein
Mol. Mass.:67067.41
Organism:Hepatitis C virus
Description:A3EZI9
Residue:631
BDBM50145815
NameBDBM50145815
Synonyms:4-(4-Hydroxy-3,5-diiodo-phenyl)-butyric acid | CHEMBL79728
TypeSmall organic molecule
Emp. Form.C10H10I2O3
Mol. Mass.431.9935
SMILESOC(=O)CCCc1cc(I)c(O)c(I)c1