Reaction Details
TargetGenome polyprotein
LigandBDBM50145828
Substrate/Competitorn/a
Meas. Tech.ChEMBL_143477 (CHEMBL751817)
Ki 800±n/a nM
Citation Wyss, DFArasappan, ASenior, MMWang, YSBeyer, BMNjoroge, FGMcCoy, MA Non-peptidic small-molecule inhibitors of the single-chain hepatitis C virus NS3 protease/NS4A cofactor complex discovered by structure-based NMR screening. J Med Chem47:2486-98 (2004) 
 
Genome polyprotein
Name:Genome polyprotein
Type:Protein
Mol. Mass.:67067.41
Organism:Hepatitis C virus
Description:A3EZI9
Residue:631
BDBM50145828
NameBDBM50145828
Synonyms:2-(4-{3-[(S)-1-Carboxy-2-(4-hydroxy-3,5-diiodo-phenyl)-ethylcarbamoyloxy]-propoxy}-benzoyl)-benzoic acid | CHEMBL82941
TypeSmall organic molecule
Emp. Form.C27H23I2NO9
Mol. Mass.759.2818
SMILESOC(=O)[C@H](Cc1cc(I)c(O)c(I)c1)NC(=O)OCCCOc1ccc(cc1)C(=O)c1ccccc1C(O)=O