Reaction Details
TargetGenome polyprotein
LigandBDBM50145816
Substrate/Competitorn/a
Meas. Tech.ChEMBL_143475 (CHEMBL751815)
Kd>60000±n/a nM
Citation Wyss, DFArasappan, ASenior, MMWang, YSBeyer, BMNjoroge, FGMcCoy, MA Non-peptidic small-molecule inhibitors of the single-chain hepatitis C virus NS3 protease/NS4A cofactor complex discovered by structure-based NMR screening. J Med Chem47:2486-98 (2004) 
 
Genome polyprotein
Name:Genome polyprotein
Type:Protein
Mol. Mass.:67067.41
Organism:Hepatitis C virus
Description:A3EZI9
Residue:631
BDBM50145816
NameBDBM50145816
Synonyms:1-Methyl-cyclopropanecarboxylic acid (4-methoxy-phenyl)-amide | CHEMBL83876
TypeSmall organic molecule
Emp. Form.C12H15NO2
Mol. Mass.205.253
SMILESCOc1ccc(NC(=O)C2(C)CC2)cc1