Reaction Details
TargetNAD-dependent histone deacetylase SIR2
LigandBDBM50146046
Substrate/Competitorn/a
Meas. Tech.ChEBML_202251
IC50 43000±n/a nM
Citation Posakony, JHirao, MStevens, SSimon, JABedalov, A Inhibitors of Sir2: evaluation of splitomicin analogues. J Med Chem47:2635-44 (2004) 
 
NAD-dependent histone deacetylase SIR2
Name:NAD-dependent histone deacetylase SIR2
Type:PROTEIN
Mol. Mass.:63277.80
Organism:Saccharomyces cerevisiae
Description:ChEMBL_942450
Residue:562
BDBM50146046
NameBDBM50146046
Synonyms:1-Phenyl-1,2-dihydro-benzo[f]chromen-3-one CHEMBL315508
TypeSmall organic molecule
Emp. Form.C19H14O2
Mol. Mass.274.3133
SMILESO=C1CC(c2ccccc2)c2c(O1)ccc1ccccc21