Reaction Details
TargetNAD-dependent histone deacetylase SIR2
LigandBDBM50146056
Substrate/Competitorn/a
Meas. Tech.ChEBML_202251
IC50 111000±n/a nM
Citation Posakony, JHirao, MStevens, SSimon, JABedalov, A Inhibitors of Sir2: evaluation of splitomicin analogues. J Med Chem47:2635-44 (2004) 
 
NAD-dependent histone deacetylase SIR2
Name:NAD-dependent histone deacetylase SIR2
Type:PROTEIN
Mol. Mass.:63277.80
Organism:Saccharomyces cerevisiae
Description:ChEMBL_942450
Residue:562
BDBM50146056
NameBDBM50146056
Synonyms:5-Hydroxy-1,2-dihydro-benzo[f]chromen-3-one | CHEMBL89217
TypeSmall organic molecule
Emp. Form.C13H10O3
Mol. Mass.214.2167
SMILESOc1cc2ccccc2c2CCC(=O)Oc12