Reaction Details
TargetNAD-dependent histone deacetylase SIR2
LigandBDBM50146060
Substrate/Competitorn/a
Meas. Tech.ChEBML_202251
IC50 59000±n/a nM
Citation Posakony, JHirao, MStevens, SSimon, JABedalov, A Inhibitors of Sir2: evaluation of splitomicin analogues. J Med Chem47:2635-44 (2004) 
 
NAD-dependent histone deacetylase SIR2
Name:NAD-dependent histone deacetylase SIR2
Type:PROTEIN
Mol. Mass.:63277.80
Organism:Saccharomyces cerevisiae
Description:ChEMBL_942450
Residue:562
BDBM50146060
NameBDBM50146060
Synonyms:1H-Naphtho[2,1-b]furan-2-one | CHEMBL314020
TypeSmall organic molecule
Emp. Form.C12H8O2
Mol. Mass.184.1907
SMILESO=C1Cc2c(O1)ccc1ccccc21