Reaction Details
TargetNAD-dependent histone deacetylase SIR2
LigandBDBM50146063
Substrate/Competitorn/a
Meas. Tech.ChEBML_202251
IC50 27000±n/a nM
Citation Posakony, JHirao, MStevens, SSimon, JABedalov, A Inhibitors of Sir2: evaluation of splitomicin analogues. J Med Chem47:2635-44 (2004) 
 
NAD-dependent histone deacetylase SIR2
Name:NAD-dependent histone deacetylase SIR2
Type:PROTEIN
Mol. Mass.:63277.80
Organism:Saccharomyces cerevisiae
Description:ChEMBL_942450
Residue:562
BDBM50146063
NameBDBM50146063
Synonyms:2-Isobutyl-1,2-dihydro-benzo[f]chromen-3-one | CHEMBL88683
TypeSmall organic molecule
Emp. Form.C17H18O2
Mol. Mass.254.3236
SMILESCC(C)CC1Cc2c(OC1=O)ccc1ccccc21