Reaction Details
TargetNAD-dependent histone deacetylase SIR2
LigandBDBM29590
Substrate/Competitorn/a
Meas. Tech.ChEBML_202251
IC50 74000±n/a nM
Citation Posakony, JHirao, MStevens, SSimon, JABedalov, A Inhibitors of Sir2: evaluation of splitomicin analogues. J Med Chem47:2635-44 (2004) 
 
NAD-dependent histone deacetylase SIR2
Name:NAD-dependent histone deacetylase SIR2
Type:PROTEIN
Mol. Mass.:63277.80
Organism:Saccharomyces cerevisiae
Description:ChEMBL_942450
Residue:562
BDBM29590
NameBDBM29590
Synonyms:1,2-Dihydro-3H-naphtho[2,1-b]pyran-3-one splitomicin
TypeSmall organic molecule
Emp. Form.C13H10O2
Mol. Mass.198.2173
SMILESO=C1CCc2c(O1)ccc1ccccc21