Reaction Details
TargetNAD-dependent histone deacetylase SIR2
LigandBDBM50146069
Substrate/Competitorn/a
Meas. Tech.ChEBML_202251
IC50 44000±n/a nM
Citation Posakony, JHirao, MStevens, SSimon, JABedalov, A Inhibitors of Sir2: evaluation of splitomicin analogues. J Med Chem47:2635-44 (2004) 
 
NAD-dependent histone deacetylase SIR2
Name:NAD-dependent histone deacetylase SIR2
Type:PROTEIN
Mol. Mass.:63277.80
Organism:Saccharomyces cerevisiae
Description:ChEMBL_942450
Residue:562
BDBM50146069
NameBDBM50146069
Synonyms:6-Methoxy-1,2-dihydro-benzo[f]chromen-3-one | CHEMBL90386
TypeSmall organic molecule
Emp. Form.C14H12O3
Mol. Mass.228.2433
SMILESCOc1cc2OC(=O)CCc2c2ccccc12