Reaction Details
TargetEstrogen receptor
LigandBDBM50146205
Substrate/Competitorn/a
Meas. Tech.ChEBML_67500
IC50 9.2±n/a nM
Citation Chesworth, RZawistoski, MPLefker, BACameron, KODay, RFMangano, FMRosati, RLColella, SPetersen, DNBrault, ALu, BPan, LCPerry, PNg, OCastleberry, TAOwen, TABrown, TAThompson, DDDaSilva-Jardine, P Tetrahydroisoquinolines as subtype selective estrogen agonists/antagonists. Bioorg Med Chem Lett14:2729-33 (2004) 
 
Estrogen receptor
Name:Estrogen receptor
Type:Protein
Mol. Mass.:66230.44
Organism:Homo sapiens (Human)
Description:P03372
Residue:595
BDBM50146205
NameBDBM50146205
Synonyms:2-Benzo[1,3]dioxol-5-ylmethyl-1-[4-(2-pyrrolidin-1-yl-ethoxy)-phenyl]-1,2,3,4-tetrahydro-isoquinolin-6-ol | CHEMBL92900
TypeSmall organic molecule
Emp. Form.C29H32N2O4
Mol. Mass.472.5754
SMILESOc1ccc2C(N(Cc3ccc4OCOc4c3)CCc2c1)c1ccc(OCCN2CCCC2)cc1