Reaction Details
TargetEstrogen receptor
LigandBDBM50146218
Substrate/Competitorn/a
Meas. Tech.ChEBML_67500
IC50 53±n/a nM
Citation Chesworth, RZawistoski, MPLefker, BACameron, KODay, RFMangano, FMRosati, RLColella, SPetersen, DNBrault, ALu, BPan, LCPerry, PNg, OCastleberry, TAOwen, TABrown, TAThompson, DDDaSilva-Jardine, P Tetrahydroisoquinolines as subtype selective estrogen agonists/antagonists. Bioorg Med Chem Lett14:2729-33 (2004) 
 
Estrogen receptor
Name:Estrogen receptor
Type:Protein
Mol. Mass.:66230.44
Organism:Homo sapiens (Human)
Description:P03372
Residue:595
BDBM50146218
NameBDBM50146218
Synonyms:1-Cyclohexylmethyl-2-phenyl-1,2,3,4-tetrahydro-isoquinolin-6-ol | CHEMBL89995
TypeSmall organic molecule
Emp. Form.C22H27NO
Mol. Mass.321.4559
SMILESOc1ccc2C(CC3CCCCC3)N(CCc2c1)c1ccccc1