Reaction Details
TargetEstrogen receptor beta
LigandBDBM50146220
Substrate/Competitorn/a
Meas. Tech.ChEBML_67820
IC50 8.9±n/a nM
Citation Chesworth, RZawistoski, MPLefker, BACameron, KODay, RFMangano, FMRosati, RLColella, SPetersen, DNBrault, ALu, BPan, LCPerry, PNg, OCastleberry, TAOwen, TABrown, TAThompson, DDDaSilva-Jardine, P Tetrahydroisoquinolines as subtype selective estrogen agonists/antagonists. Bioorg Med Chem Lett14:2729-33 (2004) 
 
Estrogen receptor beta
Name:Estrogen receptor beta
Type:Protein
Mol. Mass.:59238.43
Organism:Homo sapiens (Human)
Description:Q92731
Residue:530
BDBM50146220
NameBDBM50146220
Synonyms:2,2,2-Trifluoro-1-[(R)-6-hydroxy-1-(4-hydroxy-phenyl)-3,4-dihydro-1H-isoquinolin-2-yl]-ethanone | CHEMBL93326
TypeSmall organic molecule
Emp. Form.C17H14F3NO3
Mol. Mass.337.2932
SMILESOc1ccc(cc1)[C@H]1N(CCc2cc(O)ccc12)C(=O)C(F)(F)F