Reaction Details
TargetEstrogen receptor
LigandBDBM50146207
Substrate/Competitorn/a
Meas. Tech.ChEBML_67500
IC50 28±n/a nM
Citation Chesworth, RZawistoski, MPLefker, BACameron, KODay, RFMangano, FMRosati, RLColella, SPetersen, DNBrault, ALu, BPan, LCPerry, PNg, OCastleberry, TAOwen, TABrown, TAThompson, DDDaSilva-Jardine, P Tetrahydroisoquinolines as subtype selective estrogen agonists/antagonists. Bioorg Med Chem Lett14:2729-33 (2004) 
 
Estrogen receptor
Name:Estrogen receptor
Type:Protein
Mol. Mass.:66230.44
Organism:Homo sapiens (Human)
Description:P03372
Residue:595
BDBM50146207
NameBDBM50146207
Synonyms:4-(4-Hydroxy-phenyl)-2-(naphthalene-1-sulfonyl)-1,2,3,4-tetrahydro-isoquinolin-7-ol | CHEMBL93792
TypeSmall organic molecule
Emp. Form.C25H21NO4S
Mol. Mass.431.504
SMILESOc1ccc(cc1)C1CN(Cc2cc(O)ccc12)S(=O)(=O)c1cccc2ccccc12