Reaction Details
TargetEstrogen receptor beta
LigandBDBM50146225
Substrate/Competitorn/a
Meas. Tech.ChEBML_67820
IC50 42±n/a nM
Citation Chesworth, RZawistoski, MPLefker, BACameron, KODay, RFMangano, FMRosati, RLColella, SPetersen, DNBrault, ALu, BPan, LCPerry, PNg, OCastleberry, TAOwen, TABrown, TAThompson, DDDaSilva-Jardine, P Tetrahydroisoquinolines as subtype selective estrogen agonists/antagonists. Bioorg Med Chem Lett14:2729-33 (2004) 
 
Estrogen receptor beta
Name:Estrogen receptor beta
Type:Protein
Mol. Mass.:59238.43
Organism:Homo sapiens (Human)
Description:Q92731
Residue:530
BDBM50146225
NameBDBM50146225
Synonyms:2-Benzenesulfonyl-4-(4-hydroxy-phenyl)-1,2,3,4-tetrahydro-isoquinolin-7-ol | CHEMBL421368
TypeSmall organic molecule
Emp. Form.C21H19NO4S
Mol. Mass.381.445
SMILESOc1ccc(cc1)C1CN(Cc2cc(O)ccc12)S(=O)(=O)c1ccccc1