Reaction Details
TargetEstrogen receptor
LigandBDBM50146224
Substrate/Competitorn/a
Meas. Tech.ChEBML_67500
IC50 31±n/a nM
Citation Chesworth, RZawistoski, MPLefker, BACameron, KODay, RFMangano, FMRosati, RLColella, SPetersen, DNBrault, ALu, BPan, LCPerry, PNg, OCastleberry, TAOwen, TABrown, TAThompson, DDDaSilva-Jardine, P Tetrahydroisoquinolines as subtype selective estrogen agonists/antagonists. Bioorg Med Chem Lett14:2729-33 (2004) 
 
Estrogen receptor
Name:Estrogen receptor
Type:Protein
Mol. Mass.:66230.44
Organism:Homo sapiens (Human)
Description:P03372
Residue:595
BDBM50146224
NameBDBM50146224
Synonyms:1,2-Diphenyl-1,2,3,4-tetrahydro-isoquinolin-6-ol | CHEMBL91052
TypeSmall organic molecule
Emp. Form.C21H19NO
Mol. Mass.301.3817
SMILESOc1ccc2C(N(CCc2c1)c1ccccc1)c1ccccc1