Reaction Details
TargetEstrogen receptor beta
LigandBDBM50146268
Substrate/Competitorn/a
Meas. Tech.ChEBML_67680
IC50 25±n/a nM
Citation Kim, SWu, JChen, HYBirzin, ETChan, WYang, YTColwell, LLi, SDahllund, JDiNinno, FRohrer, SPSchaeffer, JMHammond, ML Estrogen receptor ligands. Part 4: The SAR of the syn-dihydrobenzoxathiin SERAMs. Bioorg Med Chem Lett14:2741-5 (2004) 
 
Estrogen receptor beta
Name:Estrogen receptor beta
Type:Protein
Mol. Mass.:59238.43
Organism:Homo sapiens (Human)
Description:Q92731
Residue:530
BDBM50146268
NameBDBM50146268
Synonyms:(2R,3S)-8-Ethyl-3-(4-hydroxy-phenyl)-2-[4-(2-piperidin-1-yl-ethoxy)-phenyl]-2,3-dihydro-benzo[1,4]oxathiin-7-ol | CHEMBL420068
TypeSmall organic molecule
Emp. Form.C29H33NO4S
Mol. Mass.491.642
SMILESCCc1c(O)ccc2S[C@H]([C@H](Oc12)c1ccc(OCCN2CCCCC2)cc1)c1ccc(O)cc1