Reaction Details
TargetEstrogen receptor
LigandBDBM50146272
Substrate/Competitorn/a
Meas. Tech.ChEMBL_67495 (CHEMBL679886)
IC50 1.7±n/a nM
Citation Kim, SWu, JChen, HYBirzin, ETChan, WYang, YTColwell, LLi, SDahllund, JDiNinno, FRohrer, SPSchaeffer, JMHammond, ML Estrogen receptor ligands. Part 4: The SAR of the syn-dihydrobenzoxathiin SERAMs. Bioorg Med Chem Lett14:2741-5 (2004) 
 
Estrogen receptor
Name:Estrogen receptor
Type:Protein
Mol. Mass.:66230.44
Organism:Homo sapiens (Human)
Description:P03372
Residue:595
BDBM50146272
NameBDBM50146272
Synonyms:(2S,3R)-3-(3-Hydroxy-phenyl)-2-[4-(2-pyrrolidin-1-yl-ethoxy)-phenyl]-2,3-dihydro-benzo[1,4]oxathiin-6-ol | CHEMBL327320
TypeSmall organic molecule
Emp. Form.C26H27NO4S
Mol. Mass.449.562
SMILESOc1cccc(c1)[C@H]1Sc2cc(O)ccc2O[C@H]1c1ccc(OCCN2CCCC2)cc1