Reaction Details
TargetEstrogen receptor
LigandBDBM50146257
Substrate/Competitorn/a
Meas. Tech.ChEMBL_67363 (CHEMBL873603)
IC50 1.4±n/a nM
Citation Kim, SWu, JChen, HYBirzin, ETChan, WYang, YTColwell, LLi, SDahllund, JDiNinno, FRohrer, SPSchaeffer, JMHammond, ML Estrogen receptor ligands. Part 4: The SAR of the syn-dihydrobenzoxathiin SERAMs. Bioorg Med Chem Lett14:2741-5 (2004) 
 
Estrogen receptor
Name:Estrogen receptor
Type:Protein
Mol. Mass.:66230.44
Organism:Homo sapiens (Human)
Description:P03372
Residue:595
BDBM50146257
NameBDBM50146257
Synonyms:(2S,3R)-2-[4-(2-Dimethylamino-ethoxy)-phenyl]-3-(3-hydroxy-phenyl)-2,3-dihydro-benzo[1,4]oxathiin-6-ol | CHEMBL329902
TypeSmall organic molecule
Emp. Form.C24H25NO4S
Mol. Mass.423.525
SMILESCN(C)CCOc1ccc(cc1)[C@@H]1Oc2ccc(O)cc2S[C@@H]1c1cccc(O)c1