Reaction Details
TargetEstrogen receptor
LigandBDBM50146276
Substrate/Competitorn/a
Meas. Tech.ChEBML_67363
IC50 3.4±n/a nM
Citation Kim, SWu, JChen, HYBirzin, ETChan, WYang, YTColwell, LLi, SDahllund, JDiNinno, FRohrer, SPSchaeffer, JMHammond, ML Estrogen receptor ligands. Part 4: The SAR of the syn-dihydrobenzoxathiin SERAMs. Bioorg Med Chem Lett14:2741-5 (2004) 
 
Estrogen receptor
Name:Estrogen receptor
Type:Protein
Mol. Mass.:66230.44
Organism:Homo sapiens (Human)
Description:P03372
Residue:595
BDBM50146276
NameBDBM50146276
Synonyms:(2S,3R)-2-{4-[2-(2,6-Dimethyl-piperidin-1-yl)-ethoxy]-phenyl}-3-(3-hydroxy-phenyl)-2,3-dihydro-benzo[1,4]oxathiin-6-ol | CHEMBL90794
TypeSmall organic molecule
Emp. Form.C29H33NO4S
Mol. Mass.491.642
SMILESCC1CCCC(C)N1CCOc1ccc(cc1)[C@@H]1Oc2ccc(O)cc2S[C@@H]1c1cccc(O)c1