Reaction Details
TargetEstrogen receptor beta
LigandBDBM50146269
Substrate/Competitorn/a
Meas. Tech.ChEMBL_67815 (CHEMBL673659)
IC50 121±n/a nM
Citation Kim, SWu, JChen, HYBirzin, ETChan, WYang, YTColwell, LLi, SDahllund, JDiNinno, FRohrer, SPSchaeffer, JMHammond, ML Estrogen receptor ligands. Part 4: The SAR of the syn-dihydrobenzoxathiin SERAMs. Bioorg Med Chem Lett14:2741-5 (2004) 
 
Estrogen receptor beta
Name:Estrogen receptor beta
Type:Protein
Mol. Mass.:59238.43
Organism:Homo sapiens (Human)
Description:Q92731
Residue:530
BDBM50146269
NameBDBM50146269
Synonyms:(2R,3S)-5-Chloro-3-(4-hydroxy-phenyl)-2-[4-(2-piperidin-1-yl-ethoxy)-phenyl]-2,3-dihydro-benzo[1,4]oxathiin-7-ol | CHEMBL94116
TypeSmall organic molecule
Emp. Form.C27H28ClNO4S
Mol. Mass.498.034
SMILESOc1ccc(cc1)[C@@H]1Sc2c(Cl)cc(O)cc2O[C@@H]1c1ccc(OCCN2CCCCC2)cc1