Reaction Details
TargetRetinoic acid receptor RXR-alpha
LigandBDBM50146330
Substrate/Competitorn/a
Meas. Tech.ChEMBL_196624 (CHEMBL800659)
Ki 30±n/a nM
Citation Gernert, DLNeel, DABoehm, MFLeibowitz, MDMais, DAMichellys, PYRungta, DReifel-Miller, AGrese, TA Design and synthesis of benzofused heterocyclic RXR modulators. Bioorg Med Chem Lett14:2759-63 (2004) 
 
Retinoic acid receptor RXR-alpha
Name:Retinoic acid receptor RXR-alpha
Type:PROTEIN
Mol. Mass.:50820.38
Organism:Homo sapiens (Human)
Description:ChEMBL_1456363
Residue:462
BDBM50146330
NameBDBM50146330
Synonyms:(E)-3-[3-(3,5-Diisopropyl-2-methoxy-phenyl)-benzo[b]thiophen-5-yl]-but-2-enoic acid | CHEMBL314745
TypeSmall organic molecule
Emp. Form.C25H28O3S
Mol. Mass.408.553
SMILESCOc1c(cc(cc1-c1csc2ccc(cc12)C(\C)=C\C(O)=O)C(C)C)C(C)C