Reaction Details
TargetRetinoic acid receptor RXR-alpha
LigandBDBM50146325
Substrate/Competitorn/a
Meas. Tech.ChEMBL_196618 (CHEMBL800654)
EC50 1438±n/a nM
Citation Gernert, DLNeel, DABoehm, MFLeibowitz, MDMais, DAMichellys, PYRungta, DReifel-Miller, AGrese, TA Design and synthesis of benzofused heterocyclic RXR modulators. Bioorg Med Chem Lett14:2759-63 (2004) 
 
Retinoic acid receptor RXR-alpha
Name:Retinoic acid receptor RXR-alpha
Type:PROTEIN
Mol. Mass.:50820.38
Organism:Homo sapiens (Human)
Description:ChEMBL_1456363
Residue:462
BDBM50146325
NameBDBM50146325
Synonyms:(E)-3-[3-(2-Hydroxy-3,5-diisopropyl-phenyl)-benzo[b]thiophen-5-yl]-but-2-enoic acid | CHEMBL93571
TypeSmall organic molecule
Emp. Form.C24H26O3S
Mol. Mass.394.526
SMILESCC(C)c1cc(C(C)C)c(O)c(c1)-c1csc2ccc(cc12)C(\C)=C\C(O)=O