Reaction Details
TargetRetinoic acid receptor gamma
LigandBDBM50146334
Substrate/Competitorn/a
Meas. Tech.ChEBML_195979
Ki>10000±n/a nM
Citation Gernert, DLNeel, DABoehm, MFLeibowitz, MDMais, DAMichellys, PYRungta, DReifel-Miller, AGrese, TA Design and synthesis of benzofused heterocyclic RXR modulators. Bioorg Med Chem Lett14:2759-63 (2004) 
 
Retinoic acid receptor gamma
Name:Retinoic acid receptor gamma
Type:PROTEIN
Mol. Mass.:50345.43
Organism:Homo sapiens (Human)
Description:ChEMBL_1458016
Residue:454
BDBM50146334
NameBDBM50146334
Synonyms:(E)-3-[3-(2-Butoxy-3,5-diisopropyl-phenyl)-1H-indol-5-yl]-but-2-enoic acid | CHEMBL92798
TypeSmall organic molecule
Emp. Form.C28H35NO3
Mol. Mass.433.5824
SMILESCCCCOc1c(cc(cc1-c1c[nH]c2ccc(cc12)C(\C)=C\C(O)=O)C(C)C)C(C)C