Reaction Details
TargetRetinoic acid receptor RXR-alpha
LigandBDBM50146327
Substrate/Competitorn/a
Meas. Tech.ChEMBL_196620 (CHEMBL800656)
EC50 30±n/a nM
Citation Gernert, DLNeel, DABoehm, MFLeibowitz, MDMais, DAMichellys, PYRungta, DReifel-Miller, AGrese, TA Design and synthesis of benzofused heterocyclic RXR modulators. Bioorg Med Chem Lett14:2759-63 (2004) 
 
Retinoic acid receptor RXR-alpha
Name:Retinoic acid receptor RXR-alpha
Type:PROTEIN
Mol. Mass.:50820.38
Organism:Homo sapiens (Human)
Description:ChEMBL_1456363
Residue:462
BDBM50146327
NameBDBM50146327
Synonyms:(E)-3-[3-(3,5-Di-tert-butyl-2-propoxy-phenyl)-1H-indol-5-yl]-but-2-enoic acid | CHEMBL92447
TypeSmall organic molecule
Emp. Form.C29H37NO3
Mol. Mass.447.609
SMILESCCCOc1c(cc(cc1C(C)(C)C)C(C)(C)C)-c1c[nH]c2ccc(cc12)C(\C)=C\C(O)=O